BDBM15567 (2R,3S)-2-[4-(4-fluorophenyl)phenyl]-N,N,3-trimethyl-4-(morpholin-4-yl)-4-oxobutanamide::DPP-4 ligand 9
SMILES C[C@@H]([C@@H](C(=O)N(C)C)c1ccc(cc1)-c1ccc(F)cc1)C(=O)N1CCOCC1
InChI Key InChIKey=OVGMITBLJIDRBE-HRAATJIYSA-N
Data  1 IC50
  Tab Delimited (TSV)   2D SDfile   Computed 3D by Vconf -m prep SDfile
Find this compound or compounds like it in BindingDB:
Activity Spreadsheet -- Enzyme Inhibition Constant Data from BindingDB
Found 1 hit for monomerid = 15567
TargetDipeptidyl peptidase 4(Homo sapiens (Human))
Merck Research Laboratories
LigandPNGBDBM15567((2R,3S)-2-[4-(4-fluorophenyl)phenyl]-N,N,3-trimeth...)
Affinity DataIC50:  520nMpH: 7.5 T: 2°C. Assay description: The enzyme activity resulted in the formation of the fluorescent product amidomethylcoumarin (AMC), which was monitored by excitation at 360 nm and m...
In DepthDetails ArticlePubMed