BDBM15569 (2S)-1-[(3R)-3-amino-4-(2-fluorophenyl)butanoyl]-N-{[4-(trifluoromethyl)phenyl]methyl}pyrrolidine-2-carboxamide::DPP-4 ligand 11
SMILES N[C@@H](CC(=O)N1CCC[C@H]1C(=O)NCc1ccc(cc1)C(F)(F)F)Cc1ccccc1F
InChI Key InChIKey=BCERHNLMUQCEJQ-QUCCMNQESA-N
Data  1 IC50
  Tab Delimited (TSV)   2D SDfile   Computed 3D by Vconf -m prep SDfile
Find this compound or compounds like it in BindingDB:
Activity Spreadsheet -- Enzyme Inhibition Constant Data from BindingDB
Found 1 hit for monomerid = 15569
TargetDipeptidyl peptidase 4(Homo sapiens (Human))
Merck Research Laboratories
LigandPNGBDBM15569((2S)-1-[(3R)-3-amino-4-(2-fluorophenyl)butanoyl]-N...)
Affinity DataIC50:  731nMpH: 7.5 T: 2°C. Assay description: The enzyme activity resulted in the formation of the fluorescent product amidomethylcoumarin (AMC), which was monitored by excitation at 360 nm and m...
In DepthDetails ArticlePubMed