BDBM15574 (3R)-3-amino-4-(2,5-difluorophenyl)-1-{4H,5H,6H-pyrazolo[1,5-a]imidazol-4-yl}butan-1-one::DPP-4 ligand 16
SMILES N[C@@H](CC(=O)N1CCn2nccc12)Cc1cc(F)ccc1F
InChI Key InChIKey=ONDNTJVJKCMOFN-GFCCVEGCSA-N
Data  1 IC50
  Tab Delimited (TSV)   2D SDfile   Computed 3D by Vconf -m prep SDfile
Find this compound or compounds like it in BindingDB:
Activity Spreadsheet -- Enzyme Inhibition Constant Data from BindingDB
Found 1 hit for monomerid = 15574
TargetDipeptidyl peptidase 4(Homo sapiens (Human))
Merck Research Laboratories
LigandPNGBDBM15574((3R)-3-amino-4-(2,5-difluorophenyl)-1-{4H,5H,6H-py...)
Affinity DataIC50:  1.33E+3nMpH: 7.5 T: 2°C. Assay description: The enzyme activity resulted in the formation of the fluorescent product amidomethylcoumarin (AMC), which was monitored by excitation at 360 nm and m...
Ligand InfoPC cidPC sid
In DepthDetails ArticlePubMed