BDBM15598 N-Methyl,N-(3-phenylbutyl),N-(pyrrol-2-ylmethyl)amine::methyl(4-phenylbutyl)(1H-pyrrol-2-ylmethyl)amine::pyrrole inhibitor 23
SMILES CN(CCCCc1ccccc1)Cc1ccc[nH]1
InChI Key InChIKey=XTGCHRQZDOHQJV-UHFFFAOYSA-N
Data  3 KI
  Tab Delimited (TSV)   2D SDfile   Computed 3D by Vconf -m prep SDfile
Find this compound or compounds like it in BindingDB:
Activity Spreadsheet -- Enzyme Inhibition Constant Data from BindingDB
Found 3 hits for monomerid = 15598
TargetAmine oxidase [flavin-containing] A(Bos taurus)
Sapienza University of Rome
LigandPNGBDBM15598(N-Methyl,N-(3-phenylbutyl),N-(pyrrol-2-ylmethyl)am...)
Affinity DataKi:  100nM ΔG°:  -9.96kcal/molepH: 7.4 T: 2°C. Assay description: MAO A and MAO B activities were determined spectrophotometrically using kinuramine as substrates. Fluorimetric measurements were recorded with a Perk...
In DepthDetails ArticlePubMed
TargetAmine oxidase [flavin-containing] B(Bos taurus)
Sapienza University of Rome
LigandPNGBDBM15598(N-Methyl,N-(3-phenylbutyl),N-(pyrrol-2-ylmethyl)am...)
Affinity DataKi:  2.50E+3nM. Assay description: MAO A and MAO B activities were determined spectrophotometrically using kinuramine as substrates. Fluorimetric measurements were recorded with a Perk...
In DepthDetails ArticlePubMed
TargetAmine oxidase [flavin-containing] A(Homo sapiens (Human))
Bharati Vidyapeeth Deemed University
Curated by ChEMBL
LigandPNGBDBM15598(N-Methyl,N-(3-phenylbutyl),N-(pyrrol-2-ylmethyl)am...)
Affinity DataKi:  1.00E+8nM. Assay description: Inhibition of MAO-A receptor
In DepthDetails ArticlePubMed