BDBM157886 US9023882, 159
SMILES OC(=O)COc1cccc(c1)-c1cn(cc1C#N)-c1ccc(cc1)C(O)=O
InChI Key InChIKey=YEWBRRDSZDSQCM-UHFFFAOYSA-N
Data  1 IC50
  Tab Delimited (TSV)   2D SDfile   Computed 3D by Vconf -m prep SDfile
Find this compound or compounds like it in BindingDB:
Activity Spreadsheet -- Enzyme Inhibition Constant Data from BindingDB
Found 1 hit for monomerid = 157886
TargetXanthine dehydrogenase/oxidase(Bos taurus (Bovine))
Kissei Pharmaceutical
US Patent
LigandPNGBDBM157886(US9023882, 159)
Affinity DataIC50:  2.70nMT: 2°C. Assay description: Xanthine oxidase (from bovine milk, Sigma) was prepared with phosphate-buffered saline (PBS) at 0.02 units/mL, and then the solution was added to 96 ...
In DepthDetails US Patent