BDBM157999 US9023882, 292
SMILES Cn1cc(-c2cn(cc2C#N)-c2ccc(C(O)=O)c(O)c2)c2ccccc12
InChI Key InChIKey=NGOPKNYMXAACGP-UHFFFAOYSA-N
Data  1 IC50
  Tab Delimited (TSV)   2D SDfile   Computed 3D by Vconf -m prep SDfile
Find this compound or compounds like it in BindingDB:
Activity Spreadsheet -- Enzyme Inhibition Constant Data from BindingDB
Found 1 hit for monomerid = 157999
TargetXanthine dehydrogenase/oxidase(Bos taurus (Bovine))
Kissei Pharmaceutical
US Patent
LigandPNGBDBM157999(US9023882, 292)
Affinity DataIC50:  5.20nMT: 2°C. Assay description: Xanthine oxidase (from bovine milk, Sigma) was prepared with phosphate-buffered saline (PBS) at 0.02 units/mL, and then the solution was added to 96 ...
In DepthDetails US Patent