BDBM158020 US9023882, 313
SMILES OC(=O)c1ccc(cc1O)-n1cc(C#N)c(c1)-c1ccc(Cl)s1
InChI Key InChIKey=FKDFSKGBSWTFHZ-UHFFFAOYSA-N
Data  1 IC50
  Tab Delimited (TSV)   2D SDfile   Computed 3D by Vconf -m prep SDfile
Find this compound or compounds like it in BindingDB:
Activity Spreadsheet -- Enzyme Inhibition Constant Data from BindingDB
Found 1 hit for monomerid = 158020
TargetXanthine dehydrogenase/oxidase(Bos taurus (Bovine))
Kissei Pharmaceutical
US Patent
LigandPNGBDBM158020(US9023882, 313)
Affinity DataIC50:  5.20nMT: 2°C. Assay description: Xanthine oxidase (from bovine milk, Sigma) was prepared with phosphate-buffered saline (PBS) at 0.02 units/mL, and then the solution was added to 96 ...
In DepthDetails US Patent