BDBM158072 US9023882, 371
SMILES OC(=O)c1ccc(nc1)-n1cc(C#N)c(c1)-c1ccccc1
InChI Key InChIKey=ZVNWPNOAPWSNLH-UHFFFAOYSA-N
Data  1 IC50
  Tab Delimited (TSV)   2D SDfile   Computed 3D by Vconf -m prep SDfile
Find this compound or compounds like it in BindingDB:
Activity Spreadsheet -- Enzyme Inhibition Constant Data from BindingDB
Found 1 hit for monomerid = 158072
TargetXanthine dehydrogenase/oxidase(Bos taurus (Bovine))
Kissei Pharmaceutical
US Patent
LigandPNGBDBM158072(US9023882, 371)
Affinity DataIC50:  2.40nMT: 2°C. Assay description: Xanthine oxidase (from bovine milk, Sigma) was prepared with phosphate-buffered saline (PBS) at 0.02 units/mL, and then the solution was added to 96 ...
Ligand InfoPC cidPC sid
In DepthDetails US Patent