BDBM158527 US9034866, 2
SMILES CC(C)(O)C#Cc1ccc2OCCn3cc(nc3-c2c1)C(N)=O
InChI Key InChIKey=CMHKURIYUXPNNR-UHFFFAOYSA-N
Data  3 KI
PDB links: 1 PDB ID matches this monomer.
  Tab Delimited (TSV)   2D SDfile   Computed 3D by Vconf -m prep SDfile
Find this compound or compounds like it in BindingDB:
Activity Spreadsheet -- Enzyme Inhibition Constant Data from BindingDB
Found 3 hits for monomerid = 158527
TargetMitogen-activated protein kinase kinase kinase 14(Homo sapiens (Human))
Genentech
Curated by ChEMBL
LigandPNGBDBM158527(US9034866, 2)
Affinity DataKi:  310nM. Assay description: Inhibition of NIK (unknown origin) after 1 to 2 hrs by ADP-FP assay
TargetMitogen-activated protein kinase kinase kinase 14(Homo sapiens (Human))
Genentech
Curated by ChEMBL
LigandPNGBDBM158527(US9034866, 2)
Affinity DataKi:  319nMpH: 7.2Assay Description:The ability of the nuclear factor-kappa B (NF-kB)-inducing kinase (NIK) to catalyze the hydrolysis of adenosine-5'-triphosphate (ATP) was monitored u...
LigandPNGBDBM158527(US9034866, 2)
Affinity DataKi:  320nM. Assay description: Inhibition of N-terminal His6-tagged recombinant full-length human p110delta/untagged recombinant full length human p85alpha expressed in baculovirus...
In DepthDetails ArticlePubMed