BDBM160858 US10093655, Example 28::US11014909, Example 28::US9107923, 28
SMILES Cc1cc(Oc2ncc(Cl)cc2Cl)ccc1-c1c(C)c(=O)[nH]c(=O)n1C
InChI Key InChIKey=YKNOPAFVQDUWHX-UHFFFAOYSA-N
Data  3 KI
  Tab Delimited (TSV)   2D SDfile   Computed 3D by Vconf -m prep SDfile
Find this compound or compounds like it in BindingDB:
Activity Spreadsheet -- Enzyme Inhibition Constant Data from BindingDB
Found 3 hits for monomerid = 160858
TargetD(1A) dopamine receptor(Homo sapiens (Human))
Pfizer
US Patent
LigandPNGBDBM160858(US10093655, Example 28 | US11014909, Example 28 | ...)
Affinity DataKi:  88.9nM. Assay description: The affinity of the compounds described herein was determined by competition binding assays similar to those described in Ryman-Rasmussen et al., Dif...
In DepthDetails US Patent
TargetD(1A) dopamine receptor(Homo sapiens (Human))
Pfizer
US Patent
LigandPNGBDBM160858(US10093655, Example 28 | US11014909, Example 28 | ...)
Affinity DataKi:  88.9nM. Assay description: D1 binding assays were performed using over-expressing LTK human cell lines. To determine basic assay parameters, ligand concentrations were determin...
In DepthDetails US Patent
TargetD(1A) dopamine receptor(Homo sapiens (Human))
Pfizer
US Patent
LigandPNGBDBM160858(US10093655, Example 28 | US11014909, Example 28 | ...)
Affinity DataKi:  88.9nMpH: 7.4Assay Description:The affinity of the compounds described herein was determined by competition binding assays similar to those described in Ryman-Rasmussen et al., "Di...
In DepthDetails US Patent