BDBM160947 US9108903, 12
SMILES COc1cc(F)ccc1Oc1cc(Cl)c(Cl)cc1C(=O)Nc1ccc(cc1)C(O)=O
InChI Key InChIKey=JPVADBDXDGHZBJ-UHFFFAOYSA-N
Data  1 IC50
  Tab Delimited (TSV)   2D SDfile   Computed 3D by Vconf -m prep SDfile
Find this compound or compounds like it in BindingDB:
Activity Spreadsheet -- Enzyme Inhibition Constant Data from BindingDB
Found 1 hit for monomerid = 160947
TargetSodium channel protein type 10 subunit alpha(Rattus norvegicus (Rat))
Vertex Pharmaceuticals
US Patent
LigandPNGBDBM160947(US9108903, 12)
Affinity DataIC50:  11nM. Assay description: Patch clamp electrophysiology was used to assess the efficacy and selectivity of sodium channel blockers in dorsal root ganglion neurons. Rat neurons...
In DepthDetails US Patent