BDBM160955 US9108903, 20
SMILES Cc1cc(Cl)ccc1Oc1cc(Cl)c(Cl)cc1C(=O)Nc1ccc(cc1)C(O)=O
InChI Key InChIKey=ZPTZKRNZFFQAKZ-UHFFFAOYSA-N
Data  1 IC50
  Tab Delimited (TSV)   2D SDfile   Computed 3D by Vconf -m prep SDfile
Find this compound or compounds like it in BindingDB:
Activity Spreadsheet -- Enzyme Inhibition Constant Data from BindingDB
Found 1 hit for monomerid = 160955
TargetSodium channel protein type 10 subunit alpha(Rattus norvegicus (Rat))
Vertex Pharmaceuticals
US Patent
LigandPNGBDBM160955(US9108903, 20)
Affinity DataIC50:  24nM. Assay description: Patch clamp electrophysiology was used to assess the efficacy and selectivity of sodium channel blockers in dorsal root ganglion neurons. Rat neurons...
In DepthDetails US Patent