BDBM160969 US9108903, 34
SMILES OCc1ccc(Oc2cc(Cl)c(Cl)cc2C(=O)Nc2ccc(nc2)C(O)=O)c(F)c1
InChI Key InChIKey=XMVFKJNSUYUADZ-UHFFFAOYSA-N
Data  1 IC50
  Tab Delimited (TSV)   2D SDfile   Computed 3D by Vconf -m prep SDfile
Find this compound or compounds like it in BindingDB:
Activity Spreadsheet -- Enzyme Inhibition Constant Data from BindingDB
Found 1 hit for monomerid = 160969
TargetSodium channel protein type 10 subunit alpha(Rattus norvegicus (Rat))
Vertex Pharmaceuticals
US Patent
LigandPNGBDBM160969(US9108903, 34)
Affinity DataIC50:  52nM. Assay description: Patch clamp electrophysiology was used to assess the efficacy and selectivity of sodium channel blockers in dorsal root ganglion neurons. Rat neurons...
In DepthDetails US Patent