BDBM160972 US9108903, 37
SMILES OC(=O)c1ccc(NC(=O)c2cc(Cl)c(Cl)cc2Oc2ccccc2OC(F)F)cn1
InChI Key InChIKey=CGCFKBNXDFEYIJ-UHFFFAOYSA-N
Data  1 IC50
  Tab Delimited (TSV)   2D SDfile   Computed 3D by Vconf -m prep SDfile
Find this compound or compounds like it in BindingDB:
Activity Spreadsheet -- Enzyme Inhibition Constant Data from BindingDB
Found 1 hit for monomerid = 160972
TargetSodium channel protein type 10 subunit alpha(Rattus norvegicus (Rat))
Vertex Pharmaceuticals
US Patent
LigandPNGBDBM160972(US9108903, 37)
Affinity DataIC50:  46nM. Assay description: Patch clamp electrophysiology was used to assess the efficacy and selectivity of sodium channel blockers in dorsal root ganglion neurons. Rat neurons...
In DepthDetails US Patent