BDBM163879 US9062078, 11::US9062078, 12A::US9062078, 12B::US9475819, 11::US9637496, 12B::US9695183, 12B
SMILES Fc1ccc(OCC2CC3CCC2N3C(=O)c2ccccc2-c2cccs2)nc1
InChI Key InChIKey=JIEFEDOEWSOKJT-UHFFFAOYSA-N
Data  22 KI
  Tab Delimited (TSV)   2D SDfile   Computed 3D by Vconf -m prep SDfile
Find this compound or compounds like it in BindingDB:
Activity Spreadsheet -- Enzyme Inhibition Constant Data from BindingDB
Found 22 hits for monomerid = 163879
TargetOrexin/Hypocretin receptor type 1(Homo sapiens (Human))
Janssen Pharmaceutica
US Patent
LigandPNGBDBM163879(US9062078, 11 | US9062078, 12A | US9062078, 12B | ...)
Affinity DataKi:  3nM ΔG°:  -10.8kcal/moleT: 2°C. Assay description: Human Embryonic Kidney 293 cells (HEK293) stably expressing rat orexin 1 receptor (Genebank accession number NM001525) or Chinese ovary cells (CHO) s...
Ligand InfoPC cidPC sid
In DepthDetails US Patent
TargetOrexin/Hypocretin receptor type 1(Homo sapiens (Human))
Janssen Pharmaceutica
US Patent
LigandPNGBDBM163879(US9062078, 11 | US9062078, 12A | US9062078, 12B | ...)
Affinity DataKi:  3nM. Assay description: Human Embryonic Kidney 293 cells (HEK293) stably expressing rat orexin 1 receptor (Genebank accession number NM_001525) or Chinese ovary cells (CHO) ...
Ligand InfoPC cidPC sid
In DepthDetails US Patent
TargetOrexin/Hypocretin receptor type 1(Homo sapiens (Human))
Janssen Pharmaceutica
US Patent
LigandPNGBDBM163879(US9062078, 11 | US9062078, 12A | US9062078, 12B | ...)
Affinity DataKi:  3nM ΔG°:  -10.8kcal/moleT: 2°C. Assay description: Human Embryonic Kidney 293 cells (HEK293) stably expressing rat orexin 1 receptor (Genebank accession number NM_001525) or Chinese ovary cells (CHO) ...
Ligand InfoPC cidPC sid
In DepthDetails US Patent
TargetOrexin receptor type 2(Homo sapiens (Human))
Janssen Pharmaceutica
US Patent
LigandPNGBDBM163879(US9062078, 11 | US9062078, 12A | US9062078, 12B | ...)
Affinity DataKi:  5nM. Assay description: HEK293 stably expressing human orexin 2 receptor (Genebank accession number NM_001526) were grown to confluency in DMEM (Hyclone, cat #SH30022), 10% ...
Ligand InfoPC cidPC sid
In DepthDetails US Patent
TargetOrexin receptor type 2(Homo sapiens (Human))
Janssen Pharmaceutica
US Patent
LigandPNGBDBM163879(US9062078, 11 | US9062078, 12A | US9062078, 12B | ...)
Affinity DataKi:  5nM ΔG°:  -11.9kcal/moleT: 2°C. Assay description: HEK293 stably expressing human orexin 2 receptor (Genebank accession number NM_001526) were grown to confluency in DMEM (Hyclone, cat # SH30022), 10%...
Ligand InfoPC cidPC sid
In DepthDetails US Patent
TargetOrexin receptor type 2(Homo sapiens (Human))
Janssen Pharmaceutica
US Patent
LigandPNGBDBM163879(US9062078, 11 | US9062078, 12A | US9062078, 12B | ...)
Affinity DataKi:  5nM ΔG°:  -11.9kcal/moleT: 2°C. Assay description: HEK293 stably expressing human orexin 2 receptor (Genebank accession number NM001526) were grown to confluency in DMEM (Hyclone, cat #SH30022), 10% F...
Ligand InfoPC cidPC sid
In DepthDetails US Patent
TargetOrexin/Hypocretin receptor type 1(Homo sapiens (Human))
Janssen Pharmaceutica
US Patent
LigandPNGBDBM163879(US9062078, 11 | US9062078, 12A | US9062078, 12B | ...)
Affinity DataKi:  10nM ΔG°:  -10.1kcal/moleT: 2°C. Assay description: Human Embryonic Kidney 293 cells (HEK293) stably expressing rat orexin 1 receptor (Genebank accession number NM_001525) or Chinese ovary cells (CHO) ...
Ligand InfoPC cidPC sid
In DepthDetails US Patent
TargetOrexin/Hypocretin receptor type 1(Homo sapiens (Human))
Janssen Pharmaceutica
US Patent
LigandPNGBDBM163879(US9062078, 11 | US9062078, 12A | US9062078, 12B | ...)
Affinity DataKi:  10nM. Assay description: Human Embryonic Kidney 293 cells (HEK293) stably expressing rat orexin 1 receptor (Genebank accession number NM_001525) or Chinese ovary cells (CHO) ...
Ligand InfoPC cidPC sid
In DepthDetails US Patent
TargetOrexin/Hypocretin receptor type 1(Homo sapiens (Human))
Janssen Pharmaceutica
US Patent
LigandPNGBDBM163879(US9062078, 11 | US9062078, 12A | US9062078, 12B | ...)
Affinity DataKi:  10nM ΔG°:  -10.1kcal/moleT: 2°C. Assay description: Human Embryonic Kidney 293 cells (HEK293) stably expressing rat orexin 1 receptor (Genebank accession number NM_001525) or Chinese ovary cells (CHO) ...
Ligand InfoPC cidPC sid
In DepthDetails US Patent
TargetOrexin/Hypocretin receptor type 1(Homo sapiens (Human))
Janssen Pharmaceutica
US Patent
LigandPNGBDBM163879(US9062078, 11 | US9062078, 12A | US9062078, 12B | ...)
Affinity DataKi:  10nM. Assay description: Binding affinity to human OXIR
Ligand InfoPC cidPC sid
In DepthDetails ArticlePubMed
TargetOrexin/Hypocretin receptor type 1(Homo sapiens (Human))
Janssen Pharmaceutica
US Patent
LigandPNGBDBM163879(US9062078, 11 | US9062078, 12A | US9062078, 12B | ...)
Affinity DataKi:  10nM ΔG°:  -10.1kcal/moleT: 2°C. Assay description: Human Embryonic Kidney 293 cells (HEK293) stably expressing rat orexin 1 receptor (Genebank accession number NM001525) or Chinese ovary cells (CHO) s...
Ligand InfoPC cidPC sid
In DepthDetails US Patent
TargetOrexin receptor type 2(Homo sapiens (Human))
Janssen Pharmaceutica
US Patent
LigandPNGBDBM163879(US9062078, 11 | US9062078, 12A | US9062078, 12B | ...)
Affinity DataKi:  12nM ΔG°:  -11.3kcal/moleT: 2°C. Assay description: HEK293 stably expressing human orexin 2 receptor (Genebank accession number NM_001526) were grown to confluency in DMEM (Hyclone, cat # SH30022), 10%...
Ligand InfoPC cidPC sid
In DepthDetails US Patent
TargetOrexin receptor type 2(Homo sapiens (Human))
Janssen Pharmaceutica
US Patent
LigandPNGBDBM163879(US9062078, 11 | US9062078, 12A | US9062078, 12B | ...)
Affinity DataKi:  12nM. Assay description: HEK293 stably expressing human orexin 2 receptor (Genebank accession number NM_001526) were grown to confluency in DMEM (Hyclone, cat #SH30022), 10% ...
Ligand InfoPC cidPC sid
In DepthDetails US Patent
TargetOrexin receptor type 2(Homo sapiens (Human))
Janssen Pharmaceutica
US Patent
LigandPNGBDBM163879(US9062078, 11 | US9062078, 12A | US9062078, 12B | ...)
Affinity DataKi:  12nM ΔG°:  -11.3kcal/moleT: 2°C. Assay description: HEK293 stably expressing human orexin 2 receptor (Genebank accession number NM001526) were grown to confluency in DMEM (Hyclone, cat #SH30022), 10% F...
Ligand InfoPC cidPC sid
In DepthDetails US Patent
TargetOrexin receptor type 2(Homo sapiens (Human))
Janssen Pharmaceutica
US Patent
LigandPNGBDBM163879(US9062078, 11 | US9062078, 12A | US9062078, 12B | ...)
Affinity DataKi:  12nM ΔG°:  -11.3kcal/moleT: 2°C. Assay description: HEK293 stably expressing human orexin 2 receptor (Genebank accession number NM_001526) were grown to confluency in DMEM (Hyclone, cat #SH30022), 10% ...
Ligand InfoPC cidPC sid
In DepthDetails US Patent
TargetOrexin receptor type 2(Homo sapiens (Human))
Janssen Pharmaceutica
US Patent
LigandPNGBDBM163879(US9062078, 11 | US9062078, 12A | US9062078, 12B | ...)
Affinity DataKi:  13nM. Assay description: Binding affinity to human OX2R
Ligand InfoPC cidPC sid
In DepthDetails ArticlePubMed
TargetOrexin/Hypocretin receptor type 1(Homo sapiens (Human))
Janssen Pharmaceutica
US Patent
LigandPNGBDBM163879(US9062078, 11 | US9062078, 12A | US9062078, 12B | ...)
Affinity DataKi:  177nM. Assay description: Human Embryonic Kidney 293 cells (HEK293) stably expressing rat orexin 1 receptor (Genebank accession number NM_001525) or Chinese ovary cells (CHO) ...
Ligand InfoPC cidPC sid
In DepthDetails US Patent
TargetOrexin/Hypocretin receptor type 1(Homo sapiens (Human))
Janssen Pharmaceutica
US Patent
LigandPNGBDBM163879(US9062078, 11 | US9062078, 12A | US9062078, 12B | ...)
Affinity DataKi:  177nM ΔG°:  -8.56kcal/moleT: 2°C. Assay description: Human Embryonic Kidney 293 cells (HEK293) stably expressing rat orexin 1 receptor (Genebank accession number NM_001525) or Chinese ovary cells (CHO) ...
Ligand InfoPC cidPC sid
In DepthDetails US Patent
TargetOrexin/Hypocretin receptor type 1(Homo sapiens (Human))
Janssen Pharmaceutica
US Patent
LigandPNGBDBM163879(US9062078, 11 | US9062078, 12A | US9062078, 12B | ...)
Affinity DataKi:  177nM ΔG°:  -8.56kcal/moleT: 2°C. Assay description: Human Embryonic Kidney 293 cells (HEK293) stably expressing rat orexin 1 receptor (Genebank accession number NM001525) or Chinese ovary cells (CHO) s...
Ligand InfoPC cidPC sid
In DepthDetails US Patent
TargetOrexin receptor type 2(Homo sapiens (Human))
Janssen Pharmaceutica
US Patent
LigandPNGBDBM163879(US9062078, 11 | US9062078, 12A | US9062078, 12B | ...)
Affinity DataKi:  339nM ΔG°:  -9.26kcal/moleT: 2°C. Assay description: HEK293 stably expressing human orexin 2 receptor (Genebank accession number NM_001526) were grown to confluency in DMEM (Hyclone, cat # SH30022), 10%...
Ligand InfoPC cidPC sid
In DepthDetails US Patent
TargetOrexin receptor type 2(Homo sapiens (Human))
Janssen Pharmaceutica
US Patent
LigandPNGBDBM163879(US9062078, 11 | US9062078, 12A | US9062078, 12B | ...)
Affinity DataKi:  339nM ΔG°:  -9.26kcal/moleT: 2°C. Assay description: HEK293 stably expressing human orexin 2 receptor (Genebank accession number NM001526) were grown to confluency in DMEM (Hyclone, cat #SH30022), 10% F...
Ligand InfoPC cidPC sid
In DepthDetails US Patent
TargetOrexin receptor type 2(Homo sapiens (Human))
Janssen Pharmaceutica
US Patent
LigandPNGBDBM163879(US9062078, 11 | US9062078, 12A | US9062078, 12B | ...)
Affinity DataKi:  339nM. Assay description: HEK293 stably expressing human orexin 2 receptor (Genebank accession number NM_001526) were grown to confluency in DMEM (Hyclone, cat #SH30022), 10% ...
Ligand InfoPC cidPC sid
In DepthDetails US Patent