BDBM16391 5-{3-cyclobutyl-[1,2,4]triazolo[3,4-a]pyridin-6-yl}-4-(2,4-difluorophenyl)-1,3-oxazole::triazolopyridine oxazole inhibitor 62
SMILES Fc1ccc(-c2ncoc2-c2ccc3nnc(C4CCC4)n3c2)c(F)c1
InChI Key InChIKey=VZTJNVJKEKIGHC-UHFFFAOYSA-N
Data  1 IC50
  Tab Delimited (TSV)   2D SDfile   Computed 3D by Vconf -m prep SDfile
Find this compound or compounds like it in BindingDB:
Activity Spreadsheet -- Enzyme Inhibition Constant Data from BindingDB
Found 1 hit for monomerid = 16391
TargetMitogen-activated protein kinase 14(Homo sapiens (Human))
Pfizer
LigandPNGBDBM16391(5-{3-cyclobutyl-[1,2,4]triazolo[3,4-a]pyridin-6-yl...)
Affinity DataIC50:  3.75nM. Assay description: The IC50s were determined by incubating each test compound with activated p38-alpha in a 96-well plate that had been pre-treated with ATF-2-GST to al...
In DepthDetails ArticlePubMed