BDBM163916 US9062078, 47::US9475819, 47::US9637496, 47::US9695183, 47
SMILES Cc1ccc(c(n1)C(=O)N1C2CCC1C(COc1ccc(cn1)C(F)(F)F)C2)-n1nccn1
InChI Key InChIKey=OIZULIUMQOQFAC-UHFFFAOYSA-N
Data  10 KI
  Tab Delimited (TSV)   2D SDfile   Computed 3D by Vconf -m prep SDfile
Find this compound or compounds like it in BindingDB:
Activity Spreadsheet -- Enzyme Inhibition Constant Data from BindingDB
Found 10 hits for monomerid = 163916
TargetOrexin receptor type 2(Homo sapiens (Human))
Janssen Pharmaceutica
US Patent
LigandPNGBDBM163916(US9062078, 47 | US9475819, 47 | US9637496, 47 | US...)
Affinity DataKi:  418nM. Assay description: HEK293 stably expressing human orexin 2 receptor (Genebank accession number NM_001526) were grown to confluency in DMEM (Hyclone, cat #SH30022), 10% ...
In DepthDetails US Patent
TargetOrexin receptor type 2(Homo sapiens (Human))
Janssen Pharmaceutica
US Patent
LigandPNGBDBM163916(US9062078, 47 | US9475819, 47 | US9637496, 47 | US...)
Affinity DataKi:  418nM ΔG°:  -9.13kcal/moleT: 2°C. Assay description: HEK293 stably expressing human orexin 2 receptor (Genebank accession number NM_001526) were grown to confluency in DMEM (Hyclone, cat #SH30022), 10% ...
In DepthDetails US Patent
TargetOrexin receptor type 2(Homo sapiens (Human))
Janssen Pharmaceutica
US Patent
LigandPNGBDBM163916(US9062078, 47 | US9475819, 47 | US9637496, 47 | US...)
Affinity DataKi:  418nM ΔG°:  -9.13kcal/moleT: 2°C. Assay description: HEK293 stably expressing human orexin 2 receptor (Genebank accession number NM_001526) were grown to confluency in DMEM (Hyclone, cat # SH30022), 10%...
In DepthDetails US Patent
TargetOrexin receptor type 2(Homo sapiens (Human))
Janssen Pharmaceutica
US Patent
LigandPNGBDBM163916(US9062078, 47 | US9475819, 47 | US9637496, 47 | US...)
Affinity DataKi:  418nM ΔG°:  -9.13kcal/moleT: 2°C. Assay description: HEK293 stably expressing human orexin 2 receptor (Genebank accession number NM001526) were grown to confluency in DMEM (Hyclone, cat #SH30022), 10% F...
In DepthDetails US Patent
TargetOrexin receptor type 2(Homo sapiens (Human))
Janssen Pharmaceutica
US Patent
LigandPNGBDBM163916(US9062078, 47 | US9475819, 47 | US9637496, 47 | US...)
Affinity DataKi:  420nM. Assay description: Binding affinity to human OX2R
In DepthDetails ArticlePubMed
TargetOrexin/Hypocretin receptor type 1(Rattus norvegicus (Rat))
Janssen Pharmaceutica
US Patent
LigandPNGBDBM163916(US9062078, 47 | US9475819, 47 | US9637496, 47 | US...)
Affinity DataKi:  460nM. Assay description: Human Embryonic Kidney 293 cells (HEK293) stably expressing rat orexin 1 receptor (Genebank accession number NM_001525) or Chinese ovary cells (CHO) ...
In DepthDetails US Patent
TargetOrexin/Hypocretin receptor type 1(Rattus norvegicus (Rat))
Janssen Pharmaceutica
US Patent
LigandPNGBDBM163916(US9062078, 47 | US9475819, 47 | US9637496, 47 | US...)
Affinity DataKi:  460nM ΔG°:  -8.03kcal/moleT: 2°C. Assay description: Human Embryonic Kidney 293 cells (HEK293) stably expressing rat orexin 1 receptor (Genebank accession number NM_001525) or Chinese ovary cells (CHO) ...
In DepthDetails US Patent
TargetOrexin/Hypocretin receptor type 1(Rattus norvegicus (Rat))
Janssen Pharmaceutica
US Patent
LigandPNGBDBM163916(US9062078, 47 | US9475819, 47 | US9637496, 47 | US...)
Affinity DataKi:  460nM ΔG°:  -9.07kcal/moleT: 2°C. Assay description: HEK293 stably expressing human orexin 2 receptor (Genebank accession number NM001526) were grown to confluency in DMEM (Hyclone, cat #SH30022), 10% F...
In DepthDetails US Patent
TargetOrexin/Hypocretin receptor type 1(Rattus norvegicus (Rat))
Janssen Pharmaceutica
US Patent
LigandPNGBDBM163916(US9062078, 47 | US9475819, 47 | US9637496, 47 | US...)
Affinity DataKi:  460nM ΔG°:  -8.03kcal/moleT: 2°C. Assay description: Human Embryonic Kidney 293 cells (HEK293) stably expressing rat orexin 1 receptor (Genebank accession number NM_001525) or Chinese ovary cells (CHO) ...
In DepthDetails US Patent
TargetOrexin/Hypocretin receptor type 1(Homo sapiens (Human))
Janssen Research & Development
Curated by ChEMBL
LigandPNGBDBM163916(US9062078, 47 | US9475819, 47 | US9637496, 47 | US...)
Affinity DataKi:  500nM. Assay description: Binding affinity to human OXIR
In DepthDetails ArticlePubMed