BDBM164091 US9062078, 221::US9475819, 221::US9637496, 221::US9695183, 221
SMILES FC(F)(F)c1cnc(NC2CC3CCC2N3C(=O)c2ccccc2-n2nccn2)nc1
InChI Key InChIKey=WXVOANJOHGOYDU-UHFFFAOYSA-N
Data  14 KI
  Tab Delimited (TSV)   2D SDfile   Computed 3D by Vconf -m prep SDfile
Find this compound or compounds like it in BindingDB:
Activity Spreadsheet -- Enzyme Inhibition Constant Data from BindingDB
Found 14 hits for monomerid = 164091
TargetOrexin/Hypocretin receptor type 1(Rattus norvegicus (Rat))
Janssen Pharmaceutica
US Patent
LigandPNGBDBM164091(US9062078, 221 | US9475819, 221 | US9637496, 221 |...)
Affinity DataKi:  172nM ΔG°:  -8.57kcal/moleT: 2°C. Assay description: Human Embryonic Kidney 293 cells (HEK293) stably expressing rat orexin 1 receptor (Genebank accession number NM_001525) or Chinese ovary cells (CHO) ...
In DepthDetails US Patent
TargetOrexin/Hypocretin receptor type 1(Rattus norvegicus (Rat))
Janssen Pharmaceutica
US Patent
LigandPNGBDBM164091(US9062078, 221 | US9475819, 221 | US9637496, 221 |...)
Affinity DataKi:  172nM. Assay description: Human Embryonic Kidney 293 cells (HEK293) stably expressing rat orexin 1 receptor (Genebank accession number NM_001525) or Chinese ovary cells (CHO) ...
In DepthDetails US Patent
TargetOrexin/Hypocretin receptor type 1(Rattus norvegicus (Rat))
Janssen Pharmaceutica
US Patent
LigandPNGBDBM164091(US9062078, 221 | US9475819, 221 | US9637496, 221 |...)
Affinity DataKi:  172nM ΔG°:  -8.57kcal/moleT: 2°C. Assay description: Human Embryonic Kidney 293 cells (HEK293) stably expressing rat orexin 1 receptor (Genebank accession number NM_001525) or Chinese ovary cells (CHO) ...
In DepthDetails US Patent
TargetOrexin/Hypocretin receptor type 1(Rattus norvegicus (Rat))
Janssen Pharmaceutica
US Patent
LigandPNGBDBM164091(US9062078, 221 | US9475819, 221 | US9637496, 221 |...)
Affinity DataKi:  172nM ΔG°:  -9.69kcal/moleT: 2°C. Assay description: HEK293 stably expressing human orexin 2 receptor (Genebank accession number NM001526) were grown to confluency in DMEM (Hyclone, cat #SH30022), 10% F...
In DepthDetails US Patent
TargetOrexin/Hypocretin receptor type 1(Homo sapiens (Human))
Janssen Research & Development
Curated by ChEMBL
LigandPNGBDBM164091(US9062078, 221 | US9475819, 221 | US9637496, 221 |...)
Affinity DataKi:  180nM. Assay description: Binding affinity to human OXIR
In DepthDetails ArticlePubMed
TargetOrexin/Hypocretin receptor type 1(Homo sapiens (Human))
Janssen Research & Development
Curated by ChEMBL
LigandPNGBDBM164091(US9062078, 221 | US9475819, 221 | US9637496, 221 |...)
Affinity DataKi:  200nM ΔG°:  -8.49kcal/moleT: 2°C. Assay description: Human Embryonic Kidney 293 cells (HEK293) stably expressing rat orexin 1 receptor (Genebank accession number NM_001525) or Chinese ovary cells (CHO) ...
In DepthDetails US Patent
TargetOrexin/Hypocretin receptor type 1(Homo sapiens (Human))
Janssen Research & Development
Curated by ChEMBL
LigandPNGBDBM164091(US9062078, 221 | US9475819, 221 | US9637496, 221 |...)
Affinity DataKi:  200nM. Assay description: Human Embryonic Kidney 293 cells (HEK293) stably expressing rat orexin 1 receptor (Genebank accession number NM_001525) or Chinese ovary cells (CHO) ...
In DepthDetails US Patent
TargetOrexin/Hypocretin receptor type 1(Homo sapiens (Human))
Janssen Research & Development
Curated by ChEMBL
LigandPNGBDBM164091(US9062078, 221 | US9475819, 221 | US9637496, 221 |...)
Affinity DataKi:  200nM ΔG°:  -8.49kcal/moleT: 2°C. Assay description: Human Embryonic Kidney 293 cells (HEK293) stably expressing rat orexin 1 receptor (Genebank accession number NM_001525) or Chinese ovary cells (CHO) ...
In DepthDetails US Patent
TargetOrexin/Hypocretin receptor type 1(Homo sapiens (Human))
Janssen Research & Development
Curated by ChEMBL
LigandPNGBDBM164091(US9062078, 221 | US9475819, 221 | US9637496, 221 |...)
Affinity DataKi:  200nM ΔG°:  -8.49kcal/moleT: 2°C. Assay description: Human Embryonic Kidney 293 cells (HEK293) stably expressing rat orexin 1 receptor (Genebank accession number NM001525) or Chinese ovary cells (CHO) s...
In DepthDetails US Patent
TargetOrexin receptor type 2(Homo sapiens (Human))
Janssen Pharmaceutica
US Patent
LigandPNGBDBM164091(US9062078, 221 | US9475819, 221 | US9637496, 221 |...)
Affinity DataKi:  3.30E+3nM. Assay description: HEK293 stably expressing human orexin 2 receptor (Genebank accession number NM_001526) were grown to confluency in DMEM (Hyclone, cat #SH30022), 10% ...
In DepthDetails US Patent
TargetOrexin receptor type 2(Homo sapiens (Human))
Janssen Pharmaceutica
US Patent
LigandPNGBDBM164091(US9062078, 221 | US9475819, 221 | US9637496, 221 |...)
Affinity DataKi:  3.30E+3nM ΔG°:  -7.85kcal/moleT: 2°C. Assay description: HEK293 stably expressing human orexin 2 receptor (Genebank accession number NM_001526) were grown to confluency in DMEM (Hyclone, cat #SH30022), 10% ...
In DepthDetails US Patent
TargetOrexin receptor type 2(Homo sapiens (Human))
Janssen Pharmaceutica
US Patent
LigandPNGBDBM164091(US9062078, 221 | US9475819, 221 | US9637496, 221 |...)
Affinity DataKi:  3.30E+3nM ΔG°:  -7.85kcal/moleT: 2°C. Assay description: HEK293 stably expressing human orexin 2 receptor (Genebank accession number NM_001526) were grown to confluency in DMEM (Hyclone, cat # SH30022), 10%...
In DepthDetails US Patent
TargetOrexin receptor type 2(Homo sapiens (Human))
Janssen Pharmaceutica
US Patent
LigandPNGBDBM164091(US9062078, 221 | US9475819, 221 | US9637496, 221 |...)
Affinity DataKi:  3.30E+3nM ΔG°:  -7.85kcal/moleT: 2°C. Assay description: HEK293 stably expressing human orexin 2 receptor (Genebank accession number NM001526) were grown to confluency in DMEM (Hyclone, cat #SH30022), 10% F...
In DepthDetails US Patent
TargetOrexin receptor type 2(Homo sapiens (Human))
Janssen Pharmaceutica
US Patent
LigandPNGBDBM164091(US9062078, 221 | US9475819, 221 | US9637496, 221 |...)
Affinity DataKi:  3.50E+3nM. Assay description: Binding affinity to human OX2R
In DepthDetails ArticlePubMed