BDBM165196 (4S)‐4‐(pent‐4‐yn‐1‐yl)‐3‐pentyloxetan‐2‐one (47)
SMILES CCCCC[C@H]1[C@H](CCCC#C)OC1=O
InChI Key InChIKey=DNYYDSGOXHBAHD-RYUDHWBXSA-N
Data  1 IC50
  Tab Delimited (TSV)   2D SDfile   Computed 3D by Vconf -m prep SDfile
Find this compound or compounds like it in BindingDB:
Activity Spreadsheet -- Enzyme Inhibition Constant Data from BindingDB
Found 1 hit for monomerid = 165196
TargetRhomboid domain-containing protein(Thermotoga maritima (Thermotogales))
Technische Universität München
LigandPNGBDBM165196((4S)‐4‐(pent‐4‐yn‐1&...)
Affinity DataIC50:  2.70E+4nMpH: 7.4 T: 2°C. Assay description: We selected several inhibitor structures and determined their apparent IC50 by competitive ABPP.
In DepthDetails ArticlePubMed