BDBM166687 2-Amino-2-(aminomethyl)-5-(3-nitroguanidino)pentanoic acid (L4)
SMILES NCC(N)(CCCNC(=N)N[N+]([O-])=O)C(O)=O
InChI Key InChIKey=QFSOOUHKOWAUSV-UHFFFAOYSA-N
Data  1 KI
  Tab Delimited (TSV)   2D SDfile   Computed 3D by Vconf -m prep SDfile
Find this compound or compounds like it in BindingDB:
Activity Spreadsheet -- Enzyme Inhibition Constant Data from BindingDB
Found 1 hit for monomerid = 166687
TargetNitric oxide synthase, inducible(Mus musculus (mouse))
Universidade De Lisboa
LigandPNGBDBM166687(2-Amino-2-(aminomethyl)-5-(3-nitroguanidino)pentan...)
Affinity DataKi:  2.94E+4nM. Assay description: The iNOS activity assay was based on the method of hemoglobin assay previously described with slight modifications. The activity of the enzyme was de...
Ligand InfoKEGGPC cidPC sid
In DepthDetails ArticlePubMed