BDBM167567 US9073922, 52::US9796708, Example 52
SMILES Clc1cnc(NCc2ccccc2)cc1-c1ccnc2[nH]c(cc12)C1CCNCC1
InChI Key InChIKey=NJCLIBSGAOCZBH-UHFFFAOYSA-N
Data  2 IC50
  Tab Delimited (TSV)   2D SDfile   Computed 3D by Vconf -m prep SDfile
Find this compound or compounds like it in BindingDB:
Activity Spreadsheet -- Enzyme Inhibition Constant Data from BindingDB
Found 2 hits for monomerid = 167567
TargetCyclin-T1/Cyclin-dependent kinase 9(Homo sapiens (Human))
Abbvie
US Patent
LigandPNGBDBM167567(US9073922, 52 | US9796708, Example 52)
Affinity DataIC50:  14nM. Assay description: CDK9 enzyme activities were measured using LANCE ULight TR-FRET kinase assay reagents (PerkinElmer, Waltham, Mass.). Compounds were directly added in...
In DepthDetails US Patent
TargetCyclin-dependent kinase 9(Homo sapiens (Human))
Abbvie
US Patent
LigandPNGBDBM167567(US9073922, 52 | US9796708, Example 52)
Affinity DataIC50:  14nM. Assay description: CDK9 enzyme activities were measured using LANCE ULight TR-FRET kinase assay reagents (PerkinElmer, Waltham, Mass.). Compounds were directly added in...
In DepthDetails US Patent