BDBM167862 US9073922, 359
SMILES CNC(=O)N1CCC(CC1)c1cc2c(ccnc2[nH]1)-c1nc(NCc2cccc(F)c2)c(F)cc1F
InChI Key InChIKey=CZJMSZLFJBTBHO-UHFFFAOYSA-N
Data  1 IC50
  Tab Delimited (TSV)   2D SDfile   Computed 3D by Vconf -m prep SDfile
Find this compound or compounds like it in BindingDB:
Activity Spreadsheet -- Enzyme Inhibition Constant Data from BindingDB
Found 1 hit for monomerid = 167862
TargetCyclin-dependent kinase 9(Homo sapiens (Human))
Abbvie
US Patent
LigandPNGBDBM167862(US9073922, 359)
Affinity DataIC50:  10nM. Assay description: CDK9 enzyme activities were measured using LANCE ULight TR-FRET kinase assay reagents (PerkinElmer, Waltham, Mass.). Compounds were directly added in...
In DepthDetails US Patent