BDBM168042 US9073926, 76
SMILES C[C@@H]1CNC(=O)c2cc3ccc(nc3n12)C(=O)Nc1nc2ccccc2n1CCCN(C)C
InChI Key InChIKey=GJDUQWWYWMTDRL-OAHLLOKOSA-N
Data  1 IC50
  Tab Delimited (TSV)   2D SDfile   Computed 3D by Vconf -m prep SDfile
Find this compound or compounds like it in BindingDB:
Activity Spreadsheet -- Enzyme Inhibition Constant Data from BindingDB
Found 1 hit for monomerid = 168042
TargetRibosomal protein S6 kinase alpha-3(Homo sapiens (Human))
Boehringer Ingelheim International
US Patent
LigandPNGBDBM168042(US9073926, 76)
Affinity DataIC50:  54nMpH: 7.5Assay Description:Human RSK2 protein, purchased from Invitrogen, is used to measure kinase activity utilizing Kinase Glo Plus (Promega) a homogeneous assay technology,...
In DepthDetails US Patent