BDBM168070 US9073926, 104
SMILES Cn1cc(NC(=O)c2ccc3cc4C(=O)NCCCn4c3n2)nc1C(=O)NC1CCCC1
InChI Key InChIKey=ZAAULFKSCDOLLO-UHFFFAOYSA-N
Data  1 IC50
  Tab Delimited (TSV)   2D SDfile   Computed 3D by Vconf -m prep SDfile
Find this compound or compounds like it in BindingDB:
Activity Spreadsheet -- Enzyme Inhibition Constant Data from BindingDB
Found 1 hit for monomerid = 168070
TargetRibosomal protein S6 kinase alpha-3(Homo sapiens (Human))
Boehringer Ingelheim International
US Patent
LigandPNGBDBM168070(US9073926, 104)
Affinity DataIC50:  1.60nMpH: 7.5Assay Description:Human RSK2 protein, purchased from Invitrogen, is used to measure kinase activity utilizing Kinase Glo Plus (Promega) a homogeneous assay technology,...
In DepthDetails US Patent