BDBM168614 US9079834, 9
SMILES COC(=O)N[C@@H](C(c1ccccc1)c1ccccc1)C(=O)NCCC(F)(F)C[C@@H](CO)N(CC1CC(F)(F)C1)S(=O)(=O)c1ccc2ncsc2c1
InChI Key InChIKey=DOZOWNMEPXUACB-HVNZXBJASA-N
Data  1 IC50
  Tab Delimited (TSV)   2D SDfile   Computed 3D by Vconf -m prep SDfile
Find this compound or compounds like it in BindingDB:
Activity Spreadsheet -- Enzyme Inhibition Constant Data from BindingDB
Found 1 hit for monomerid = 168614
TargetGag-Pol polyprotein(Human immunodeficiency virus type 1 group M subtyp...)
Merck Canada
US Patent
LigandPNGBDBM168614(US9079834, 9)
Affinity DataIC50:  5.62nM. Assay description: Assays for the inhibition of acute HIV infection of T-lymphoid cells were conducted in accordance with Vacca, J.P. et al, Proc. Natl. Acad. Sci. USA ...
In DepthDetails US Patent