BDBM170457 US9085531, 122
SMILES CN1CC(c2ccc3[nH]ncc3c2)c2ccccc2C1
InChI Key
Data  3 KI  3 IC50
  Tab Delimited (TSV)   2D SDfile   Computed 3D by Vconf -m prep SDfile
Find this compound or compounds like it in BindingDB:
Activity Spreadsheet -- Enzyme Inhibition Constant Data from BindingDB
Found 6 hits for monomerid = 170457
TargetSodium-dependent noradrenaline transporter(Homo sapiens (Human))
Albany Molecular Research
US Patent
LigandPNGBDBM170457(US9085531, 122)
Affinity DataKi:  11.5nMpH: 7.4Assay Description:In order to evaluate the relative affinity of the various compounds at the NE, DA and 5HT transporters, HEK293E cell lines were developed to express ...
In DepthDetails US Patent
TargetSodium-dependent dopamine transporter(Homo sapiens (Human))
Albany Molecular Research
US Patent
LigandPNGBDBM170457(US9085531, 122)
Affinity DataKi:  29.4nMpH: 7.4Assay Description:In order to evaluate the relative affinity of the various compounds at the NE, DA and 5HT transporters, HEK293E cell lines were developed to express ...
In DepthDetails US Patent
TargetSodium-dependent serotonin transporter(Homo sapiens (Human))
Albany Molecular Research
US Patent
LigandPNGBDBM170457(US9085531, 122)
Affinity DataKi:  180nMpH: 7.4Assay Description:In order to evaluate the relative affinity of the various compounds at the NE, DA and 5HT transporters, HEK293E cell lines were developed to express ...
In DepthDetails US Patent
TargetSodium-dependent noradrenaline transporter(Homo sapiens (Human))
Albany Molecular Research
US Patent
LigandPNGBDBM170457(US9085531, 122)
Affinity DataIC50:  11nM. Assay description: Displacement of [125I]-RTI-55 from recombinant NET (unknown origin) expressed in HEK cells by saturation binding analysis
In DepthDetails ArticlePubMed
TargetSodium-dependent dopamine transporter(Homo sapiens (Human))
Albany Molecular Research
US Patent
LigandPNGBDBM170457(US9085531, 122)
Affinity DataIC50:  23nM. Assay description: Displacement of [125I]-RTI-55 from recombinant DAT (unknown origin) expressed in HEK cells by saturation binding analysis
In DepthDetails ArticlePubMed
TargetSodium-dependent serotonin transporter(Homo sapiens (Human))
Albany Molecular Research
US Patent
LigandPNGBDBM170457(US9085531, 122)
Affinity DataIC50:  260nM. Assay description: Displacement of [125I]-RTI-55 from recombinant SERT (unknown origin) expressed in HEK cells by saturation binding analysis
In DepthDetails ArticlePubMed