BDBM170892 US9085555, 320
SMILES NC(=O)n1cc(NC(=O)N2[C@@H]3C[C@@H]3C[C@H]2C(=O)N[C@H](CO)c2cccc(Cl)c2)c2ccccc12
InChI Key InChIKey=NYJZPZCERLBYKI-STCFGPAYSA-N
Data  1 IC50
  Tab Delimited (TSV)   2D SDfile   Computed 3D by Vconf -m prep SDfile
Find this compound or compounds like it in BindingDB:
Activity Spreadsheet -- Enzyme Inhibition Constant Data from BindingDB
Found 1 hit for monomerid = 170892
TargetComplement factor D(Homo sapiens (Human))
Novartis
US Patent
LigandPNGBDBM170892(US9085555, 320)
Affinity DataIC50:  7nMpH: 7.5 T: 2°C. Assay description: Recombinant human factor D (expressed in E. coli and purified using standard methods) at 10 nM concentration is incubated with test compound at vario...
In DepthDetails US Patent