BDBM171319 US9085555, 749
SMILES NC(=O)c1nn(CC(=O)N2[C@@H]3C[C@@H]3C[C@H]2C(=O)Nc2cccc(Br)n2)c2cc(Cl)ccc12
InChI Key InChIKey=ZWWWLCMNMOHYFL-YVLXSGLVSA-N
Data  1 IC50
  Tab Delimited (TSV)   2D SDfile   Computed 3D by Vconf -m prep SDfile
Find this compound or compounds like it in BindingDB:
Activity Spreadsheet -- Enzyme Inhibition Constant Data from BindingDB
Found 1 hit for monomerid = 171319
TargetComplement factor D(Homo sapiens (Human))
Novartis
US Patent
LigandPNGBDBM171319(US9085555, 749)
Affinity DataIC50:  4nMpH: 7.5 T: 2°C. Assay description: Recombinant human factor D (expressed in E. coli and purified using standard methods) at 10 nM concentration is incubated with test compound at vario...
In DepthDetails US Patent