BDBM171326 US9085555, 756
SMILES CO[C@@H]1[C@@H](F)CN([C@@H]1C(=O)Nc1cccc(Br)n1)C(=O)Cn1nc(C(C)=O)c2ccccc12
InChI Key InChIKey=AYFDOHZLMOTKKF-SZFUDVHCSA-N
Data  1 IC50
  Tab Delimited (TSV)   2D SDfile   Computed 3D by Vconf -m prep SDfile
Find this compound or compounds like it in BindingDB:
Activity Spreadsheet -- Enzyme Inhibition Constant Data from BindingDB
Found 1 hit for monomerid = 171326
TargetComplement factor D(Homo sapiens (Human))
Novartis
US Patent
LigandPNGBDBM171326(US9085555, 756)
Affinity DataIC50:  7nMpH: 7.5 T: 2°C. Assay description: Recombinant human factor D (expressed in E. coli and purified using standard methods) at 10 nM concentration is incubated with test compound at vario...
In DepthDetails US Patent