BDBM171824 US9085572, 34
SMILES Cc1ccnc(c1)-n1[nH]cc(-c2ccc(nc2)C#N)c1=O
InChI Key InChIKey=YXBXEIIRBJVTBQ-UHFFFAOYSA-N
Data  1 IC50
  Tab Delimited (TSV)   2D SDfile   Computed 3D by Vconf -m prep SDfile
Find this compound or compounds like it in BindingDB:
Activity Spreadsheet -- Enzyme Inhibition Constant Data from BindingDB
Found 1 hit for monomerid = 171824
Targetvon Hippel-Lindau disease tumor suppressor(Homo sapiens (Human))
Bayer Intellectual Property
US Patent
LigandPNGBDBM171824(US9085572, 34)
Affinity DataIC50:  180nMpH: 7.5Assay Description:Hydroxylated HIF bonds specifically to the von Hippel-Lindau protein-elongin B-elongin C complex (VBC complex). This interaction occurs only if HIF i...
In DepthDetails US Patent