BDBM17254 3-chloro-N-{4-chloro-2-[(4-chlorophenyl)carbamoyl]phenyl}-4-({[2-(2-hydroxyethoxy)ethyl]amino}methyl)thiophene-2-carboxamide::thiophene-containing non-amidine inhibitor, 56
SMILES OCCOCCNCc1csc(C(=O)Nc2ccc(Cl)cc2C(=O)Nc2ccc(Cl)cc2)c1Cl
InChI Key InChIKey=UXFYQNNDCOYLRK-UHFFFAOYSA-N
Data  2 KI
  Tab Delimited (TSV)   2D SDfile   Computed 3D by Vconf -m prep SDfile
Find this compound or compounds like it in BindingDB:
Activity Spreadsheet -- Enzyme Inhibition Constant Data from BindingDB
Found 2 hits for monomerid = 17254
TargetCoagulation factor X(Homo sapiens (Human))
Berlex
LigandPNGBDBM17254(3-chloro-N-{4-chloro-2-[(4-chlorophenyl)carbamoyl]...)
Affinity DataKi:  3.40nM. Assay description: The enzyme activities were determined kinetically as the initial rate of cleavage of a peptide p-nitroanilide. Km for enzyme and substrate was determ...
In DepthDetails ArticlePubMed
TargetProthrombin(Homo sapiens (Human))
Berlex
LigandPNGBDBM17254(3-chloro-N-{4-chloro-2-[(4-chlorophenyl)carbamoyl]...)
Affinity DataKi:  3.20E+3nM. Assay description: The enzyme activities were determined kinetically as the initial rate of cleavage of a peptide p-nitroanilide. Km for enzyme and substrate was determ...
In DepthDetails ArticlePubMed