BDBM172640 US9090628, 300
SMILES CC(C)n1nc(C)nc1-c1cn2CCOc3cc(C)c(cc3-c2n1)[C@H](C)N1CCN(CC1)C(C)(C)C
InChI Key InChIKey=ROEMKOMVFBZVIY-FQEVSTJZSA-N
Data  1 KI  1 IC50
  Tab Delimited (TSV)   2D SDfile   Computed 3D by Vconf -m prep SDfile
Find this compound or compounds like it in BindingDB:
Activity Spreadsheet -- Enzyme Inhibition Constant Data from BindingDB
Found 2 hits for monomerid = 172640
LigandPNGBDBM172640(US9090628, 300)
Affinity DataKi:  0.880nM. Assay description: Binding affinity to PI3Kdelta (unknown origin)
In DepthDetails ArticlePubMed
LigandPNGBDBM172640(US9090628, 300)
Affinity DataIC50:  0.881nMpH: 7.5Assay Description:PI3K enzymatic activity was assayed by measuring the amount of product phosphatidylinositol 3,4,5-phosphate (PIP3) formed from substrate 4,5 phosphat...
In DepthDetails US Patent