BDBM173209 US9096595, 12
SMILES COc1ccc2n3CC(CCc3c(CC(O)=O)c2c1)N(C)c1nc2cc(F)ccc2o1
InChI Key InChIKey=FNLWHUAEBUDTJM-UHFFFAOYSA-N
Data  1 IC50
  Tab Delimited (TSV)   2D SDfile   Computed 3D by Vconf -m prep SDfile
Find this compound or compounds like it in BindingDB:
Activity Spreadsheet -- Enzyme Inhibition Constant Data from BindingDB
Found 1 hit for monomerid = 173209
TargetProstaglandin D2 receptor 2(Homo sapiens (Human))
Actelion Pharmaceuticals
US Patent
LigandPNGBDBM173209(US9096595, 12)
Affinity DataIC50:  231nMpH: 7.0 T: 2°C. Assay description: Binding assay was performed in a final assay volume of 250 ul. First, 25 ul of test compound, previously diluted in Binding-Buffer (Binding-Buffer: 5...
In DepthDetails US Patent