BDBM173220 US9096595, 23
SMILES CN(C1CCc2c(CC(O)=O)c3cc(OC(F)(F)F)ccc3n2C1)c1ncc(Cl)cn1
InChI Key InChIKey=URTOQTVUMSVQGD-UHFFFAOYSA-N
Data  1 IC50
  Tab Delimited (TSV)   2D SDfile   Computed 3D by Vconf -m prep SDfile
Find this compound or compounds like it in BindingDB:
Activity Spreadsheet -- Enzyme Inhibition Constant Data from BindingDB
Found 1 hit for monomerid = 173220
TargetProstaglandin D2 receptor 2(Homo sapiens (Human))
Actelion Pharmaceuticals
US Patent
LigandPNGBDBM173220(US9096595, 23)
Affinity DataIC50:  354nMpH: 7.0 T: 2°C. Assay description: Binding assay was performed in a final assay volume of 250 ul. First, 25 ul of test compound, previously diluted in Binding-Buffer (Binding-Buffer: 5...
In DepthDetails US Patent