BDBM173234 US9096595, 37
SMILES OC(=O)Cc1c2CCC(Cn2c2cc(Cl)ccc12)Nc1ncc(Cl)cn1
InChI Key InChIKey=GKFROFLPOOEIOK-UHFFFAOYSA-N
Data  1 IC50
  Tab Delimited (TSV)   2D SDfile   Computed 3D by Vconf -m prep SDfile
Find this compound or compounds like it in BindingDB:
Activity Spreadsheet -- Enzyme Inhibition Constant Data from BindingDB
Found 1 hit for monomerid = 173234
TargetProstaglandin D2 receptor 2(Homo sapiens (Human))
Actelion Pharmaceuticals
US Patent
LigandPNGBDBM173234(US9096595, 37)
Affinity DataIC50:  27nMpH: 7.0 T: 2°C. Assay description: Binding assay was performed in a final assay volume of 250 ul. First, 25 ul of test compound, previously diluted in Binding-Buffer (Binding-Buffer: 5...
In DepthDetails US Patent