BDBM173237 US9096595, 40
SMILES CN(C1CCc2c(CC(O)=O)c3ccc(Cl)cc3n2C1)c1ncc2cc(F)ccc2n1
InChI Key InChIKey=CEWBFBFOCXBKSB-UHFFFAOYSA-N
Data  1 IC50
  Tab Delimited (TSV)   2D SDfile   Computed 3D by Vconf -m prep SDfile
Find this compound or compounds like it in BindingDB:
Activity Spreadsheet -- Enzyme Inhibition Constant Data from BindingDB
Found 1 hit for monomerid = 173237
TargetProstaglandin D2 receptor 2(Homo sapiens (Human))
Actelion Pharmaceuticals
US Patent
LigandPNGBDBM173237(US9096595, 40)
Affinity DataIC50:  5nMpH: 7.0 T: 2°C. Assay description: Binding assay was performed in a final assay volume of 250 ul. First, 25 ul of test compound, previously diluted in Binding-Buffer (Binding-Buffer: 5...
In DepthDetails US Patent