BDBM173483 US9096606, 20
SMILES CO[C@]12CC[C@@]3(C[C@@H]1COCc1cccc(Cl)c1)[C@H]1Cc4ccc(O)c5O[C@@H]2[C@]3(CC[N]1(C)CC1CC1)c45
InChI Key InChIKey=ZNUDXUGSFCIQFQ-BWTJNEPQSA-N
Data  2 KI
  Tab Delimited (TSV)   2D SDfile   Computed 3D by Vconf -m prep SDfile
Find this compound or compounds like it in BindingDB:
Activity Spreadsheet -- Enzyme Inhibition Constant Data from BindingDB
Found 2 hits for monomerid = 173483
TargetKappa-type opioid receptor(Homo sapiens (Human))
Purdue Pharma
US Patent
LigandPNGBDBM173483(US9096606, 20)
Affinity DataKi:  0.270nM ΔG°:  -12.1kcal/molepH: 7.4 T: 2°C. Assay description: Membranes from recombinant HEK-293 cells expressing the human kippa opioid receptor (cloned in house) were prepared by lysing cells in ice cold hypot...
In DepthDetails US Patent
TargetMu-type opioid receptor(Homo sapiens (Human))
Purdue Pharma
US Patent
LigandPNGBDBM173483(US9096606, 20)
Affinity DataKi:  6.26nM ΔG°:  -12.1kcal/molepH: 7.4 T: 2°C. Assay description: Radioligand dose-displacement binding assays for -opioid receptors used 0.3 nM [3H]-diprenorphine (Perkin Elmer, Shelton, Conn.), with 5 mg membrane ...
In DepthDetails US Patent