BDBM173583 (2E)-3-(2,5-dihydroxyphenyl)-1-(3-hydroxynaphthalen-2-yl) prop-2-en-1-one (1b)
SMILES Oc1ccc(O)c(\C=C\C(=O)c2cc3ccccc3cc2O)c1
InChI Key InChIKey=IKVYCQCLANUFSJ-FNORWQNLSA-N
Data  1 KI  1 IC50
  Tab Delimited (TSV)   2D SDfile   Computed 3D by Vconf -m prep SDfile
Find this compound or compounds like it in BindingDB:
Activity Spreadsheet -- Enzyme Inhibition Constant Data from BindingDB
Found 1 hit for monomerid = 173583
TargetPolyphenol oxidase 1 [N65D,S176D,K211T,P277A,P406L](Agaricus bisporus (Mushroom))
University of Technology Sydney
LigandPNGBDBM173583((2E)-3-(2,5-dihydroxyphenyl)-1-(3-hydroxynaphthale...)
Affinity DataKi:  1.08E+4nM IC50:  2.04E+4nMpH: 6.8Assay Description:The mushroom tyrosinase inhibition activity of hydroxy naphthylchalcone compounds was measured using L-DOPA as substrate. The activity assay used 3 m...
In DepthDetails ArticlePubMed