BDBM175968 US10047103, 1::US9688695, 1
SMILES COc1nn2cc(nc2s1)-c1cc2c(OCc3csc(C)n3)cc(OC)cc2o1
InChI Key InChIKey=MJOYITBVGFBTNC-UHFFFAOYSA-N
Data  1 IC50  2 EC50
  Tab Delimited (TSV)   2D SDfile   Computed 3D by Vconf -m prep SDfile
Find this compound or compounds like it in BindingDB:
Activity Spreadsheet -- Enzyme Inhibition Constant Data from BindingDB
Found 3 hits for monomerid = 175968
TargetProteinase-activated receptor 4(Homo sapiens (Human))
Bristol-Myers Squibb
US Patent
LigandPNGBDBM175968(US10047103, 1 | US9688695, 1)
Affinity DataEC50:  1.80nMT: 2°C. Assay description: The activity of the PAR4 antagonists of the present invention were tested in PAR4 expressing cells by monitoring H-Ala-Phe(4-F)-Pro-Gly-Trp-Leu-Val-L...
Ligand InfoPC cidPC sid
In DepthDetails US Patent
TargetProteinase-activated receptor 4(Homo sapiens (Human))
Bristol-Myers Squibb
US Patent
LigandPNGBDBM175968(US10047103, 1 | US9688695, 1)
Affinity DataIC50:  1.80nM. Assay description: Antagonist activity at full length human PAR4 expressed in HEK293 cells assessed as reduction in H-Ala-Phe(4-F)-Pro-Gly-Trp-Leu-Val-Lys-Asn-Gly-NH2 i...
Ligand InfoPC cidPC sid
In DepthDetails PubMed
TargetProteinase-activated receptor 4(Homo sapiens (Human))
Bristol-Myers Squibb
US Patent
LigandPNGBDBM175968(US10047103, 1 | US9688695, 1)
Affinity DataEC50:  1.80nMT: 2°C. Assay description: Briefly, HEK293 EBNA PAR4 clone 20664.1J cells were plated 24 hrs. prior to experiment in 384 well, Poly-D-Lysine coated, black, clear bottom plates ...
Ligand InfoPC cidPC sid
In DepthDetails US Patent