BDBM176829 US10307413, Compound 10::US10391089, Compound 10::US10980794, Cmpd No 10::US9675614, 10
SMILES OC(CNC(=O)c1cccc(c1)-c1cc[nH]n1)CN1CCc2ccccc2C1
InChI Key
Data  4 IC50
  Tab Delimited (TSV)   2D SDfile   Computed 3D by Vconf -m prep SDfile
Find this compound or compounds like it in BindingDB:
Activity Spreadsheet -- Enzyme Inhibition Constant Data from BindingDB
Found 4 hits for monomerid = 176829
TargetProtein arginine N-methyltransferase 5(Homo sapiens (Human))
Epizyme
US Patent
LigandPNGBDBM176829(US10307413, Compound 10 | US10391089, Compound 10 ...)
Affinity DataIC50: <100nM. Assay description: The assays were all performed in a buffer consisting of 20 mM Bicine (pH=7.6), 1 mM TCEP, 0.005% BSG, and 0.002% Tween20, prepared on the day of use....
Ligand InfoPC cidPC sid
In DepthDetails US Patent
TargetProtein arginine N-methyltransferase 5(Homo sapiens (Human))
Epizyme
US Patent
LigandPNGBDBM176829(US10307413, Compound 10 | US10391089, Compound 10 ...)
Affinity DataIC50: <100nM. Assay description: The assays were all performed in a buffer consisting of 20 mM Bicine (pH=7.6), 1 mM TCEP, 0.005% BSG, and 0.002% Tween20, prepared on the day of use....
Ligand InfoPC cidPC sid
In DepthDetails US Patent
TargetMethylosome protein 50/Protein arginine N-methyltransferase 5(Homo sapiens (Human))
Epizyme
US Patent
LigandPNGBDBM176829(US10307413, Compound 10 | US10391089, Compound 10 ...)
Affinity DataIC50: <100nM. Assay description: The assays were all performed in a buffer consisting of 20 mM Bicine (pH=7.6), 1 mM TCEP, 0.005% BSG, and 0.002% Tween20, prepared on the day of use....
Ligand InfoPC cidPC sid
In DepthDetails US Patent
TargetProtein arginine N-methyltransferase 5(Homo sapiens (Human))
Epizyme
US Patent
LigandPNGBDBM176829(US10307413, Compound 10 | US10391089, Compound 10 ...)
Affinity DataIC50: <100nM. Assay description: The assays were all performed in a buffer consisting of 20 mM Bicine (pH=7.6), 1 mM TCEP, 0.005% BSG, and 0.002% Tween20, prepared on the day of use....
Ligand InfoPC cidPC sid
In DepthDetails US Patent