BDBM17702 2-aminobenzoxazole, 27::4-({2-[(4-chloro-3-{[(2S)-1-methylpyrrolidin-2-yl]methoxy}phenyl)amino]-1,3-benzoxazol-5-yl}oxy)pyridine-2-carboxamide
SMILES CN1CCC[C@H]1COc1cc(Nc2nc3cc(Oc4ccnc(c4)C(N)=O)ccc3o2)ccc1Cl
InChI Key InChIKey=PPPJFYDGNJWIOT-INIZCTEOSA-N
Data  1 KI
  Tab Delimited (TSV)   2D SDfile   Computed 3D by Vconf -m prep SDfile
Find this compound or compounds like it in BindingDB:
Activity Spreadsheet -- Enzyme Inhibition Constant Data from BindingDB
Found 1 hit for monomerid = 17702
TargetVascular endothelial growth factor receptor 2(Homo sapiens (Human))
Amgen
LigandPNGBDBM17702(2-aminobenzoxazole, 27 | 4-({2-[(4-chloro-3-{[(2S)...)
Affinity DataKi:  3nM. Assay description: The assay involves the phosphorylation of a biotinylated substrate and the detection of this phosphorylation after the addition of a streptavidin-all...
In DepthDetails ArticlePubMed