BDBM177692 US9120772, 1
SMILES CN(C)C(=O)c1cccc(Nc2c(NC(C3CCOCC3)c3ccc(C)o3)c(=O)c2=O)c1O
InChI Key InChIKey=NIKNBUUQERIBKV-UHFFFAOYSA-N
Data  2 IC50
  Tab Delimited (TSV)   2D SDfile   Computed 3D by Vconf -m prep SDfile
Find this compound or compounds like it in BindingDB:
Activity Spreadsheet -- Enzyme Inhibition Constant Data from BindingDB
Found 2 hits for monomerid = 177692
TargetC-X-C chemokine receptor type 2(Homo sapiens (Human))
Galderma Research & Development
US Patent
LigandPNGBDBM177692(US9120772, 1)
Affinity DataIC50:  212nM. Assay description: The in vitro affinity of the compounds of the present invention for the CXCR1 and CXCR2 receptors was determined on a functional test of the beta -ar...
In DepthDetails US Patent
TargetC-X-C chemokine receptor type 1(Homo sapiens (Human))
Galderma Research & Development
US Patent
LigandPNGBDBM177692(US9120772, 1)
Affinity DataIC50:  5.44E+3nM. Assay description: The in vitro affinity of the compounds of the present invention for the CXCR1 and CXCR2 receptors was determined on a functional test of the beta -ar...
In DepthDetails US Patent