BDBM178015 (Z)-N-(3-(4-aminosulfonylphenyl)-4-methylthiazol-2(3H)-ylidene)-3-methylbenzamide (3c)
SMILES Cc1cs\c(=N/C(=O)c2cccc(C)c2)n1-c1ccc(cc1)S(N)(=O)=O
InChI Key InChIKey=QVMSAOBRXJQVEE-ZZEZOPTASA-N
Data  1 IC50
  Tab Delimited (TSV)   2D SDfile   Computed 3D by Vconf -m prep SDfile
Find this compound or compounds like it in BindingDB:
Activity Spreadsheet -- Enzyme Inhibition Constant Data from BindingDB
Found 1 hit for monomerid = 178015
TargetUrease(Canavalia ensiformis (Jack bean) (Horse bean))
Quaid-I-Azam University
LigandPNGBDBM178015((Z)-N-(3-(4-aminosulfonylphenyl)-4-methylthiazol-2...)
Affinity DataIC50:  87nMpH: 8.2Assay Description:The urease inhibitory activity of synthesized sulfonamides (3a-j) was determined by measuring the amount of ammonia produced by the indophenols metho...
In DepthDetails ArticlePubMed