BDBM179830 US9676701, 66 4′-((trans)-2-aminocyclopropyl)-4-fluorobiphenyl-3-ol hydrochloride
SMILES N[C@H]1C[C@@H]1c1ccc(cc1)-c1ccc(F)c(O)c1
InChI Key InChIKey=MQCYPXBHVYQSHK-OCCSQVGLSA-N
Data  3 KI
  Tab Delimited (TSV)   2D SDfile   Computed 3D by Vconf -m prep SDfile
Find this compound or compounds like it in BindingDB:
Activity Spreadsheet -- Enzyme Inhibition Constant Data from BindingDB
Found 3 hits for monomerid = 179830
TargetLysine-specific histone demethylase 1A(Homo sapiens (Human))
Oryzon Genomics
US Patent
LigandPNGBDBM179830(US9676701, 66 4′-((trans)-2-aminocyclopropyl...)
Affinity DataKi:  50nM ΔG°:  -9.95kcal/molepH: 7.4 T: 2°C. Assay description: Briefly, a fixed amount of LSD1 was incubated on ice for 15 minutes, in the absence and/or in the presence of various concentrations of inhibitor (e....
Ligand InfoPC cidPC sid
In DepthDetails US Patent
TargetAmine oxidase [flavin-containing] A(Homo sapiens (Human))
Oryzon Genomics
US Patent
LigandPNGBDBM179830(US9676701, 66 4′-((trans)-2-aminocyclopropyl...)
Affinity DataKi: >1.00E+3nMpH: 7.5Assay Description:Assays were conducted in 96-well black plates with clear bottom (Corning) in a final volume of 100 μL. The assay buffer was 100 mM HEPES, pH 7.5...
Ligand InfoPC cidPC sid
In DepthDetails US Patent
TargetAmine oxidase [flavin-containing] B(Homo sapiens (Human))
Oryzon Genomics
US Patent
LigandPNGBDBM179830(US9676701, 66 4′-((trans)-2-aminocyclopropyl...)
Affinity DataKi: >1.00E+3nMpH: 7.5Assay Description:Assays were conducted in 96-well black plates with clear bottom (Corning) in a final volume of 100 μL. The assay buffer was 100 mM HEPES, pH 7.5...
Ligand InfoPC cidPC sid
In DepthDetails US Patent