BDBM180730 US8829029, 30
SMILES Fc1ccc2onc(C3CCN(CC[C@H]4CC[C@@H](CC4)NC(=O)c4ccc5OCOc5c4)CC3)c2c1
InChI Key InChIKey=PGQVBLPLAKZWKQ-LBZQVFOQSA-N
Data  2 KI
  Tab Delimited (TSV)   2D SDfile   Computed 3D by Vconf -m prep SDfile
Find this compound or compounds like it in BindingDB:
Activity Spreadsheet -- Enzyme Inhibition Constant Data from BindingDB
Found 2 hits for monomerid = 180730
TargetD(3) dopamine receptor(Homo sapiens (Human))
Hoffmann-La Roche
US Patent
LigandPNGBDBM180730(US8829029, 30)
Affinity DataKi:  3.86nM. Assay description: Aliquots of membrane preparations were thawed at RT, resuspended in assay buffer (D2, D3: 50 mM Tris-HCl, 120 mM NaCl, 5 mM MgCl2, 1 mM EDTA, 5 mM KC...
In DepthDetails US Patent
Target5-hydroxytryptamine receptor 2A(Homo sapiens (Human))
Hoffmann-La Roche
US Patent
LigandPNGBDBM180730(US8829029, 30)
Affinity DataKi:  11.2nM. Assay description: Aliquots of membrane preparations were thawed at RT, resuspended in assay buffer (D2, D3: 50 mM Tris-HCl, 120 mM NaCl, 5 mM MgCl2, 1 mM EDTA, 5 mM KC...
In DepthDetails US Patent