BDBM180880 US9133182, Example 9
SMILES O[C@@H]([C@@H]1COC(=O)N1c1ccc(C#N)c(Cl)c1)C(F)(F)F
InChI Key InChIKey=OCLUFVULSBZQOP-UWVGGRQHSA-N
Data  1 IC50
  Tab Delimited (TSV)   2D SDfile   Computed 3D by Vconf -m prep SDfile
Find this compound or compounds like it in BindingDB:
Activity Spreadsheet -- Enzyme Inhibition Constant Data from BindingDB
Found 1 hit for monomerid = 180880
TargetAndrogen receptor(Rattus norvegicus (Rat))
Radius Health
US Patent
LigandPNGBDBM180880(US9133182, Example 9)
Affinity DataIC50:  45nM. Assay description: In order to demonstrate the utility of the compounds of this invention, an androgen receptor binding assay was performed wherein many of the compound...
In DepthDetails US Patent