BDBM180885 US9133182, Example 14
SMILES Cc1c(ccc(C#N)c1C(F)(F)F)N1[C@H](COC1=O)[C@@H](O)C(F)(F)F
InChI Key InChIKey=DCTYIEQDJSQQKS-MWLCHTKSSA-N
Data  1 IC50
  Tab Delimited (TSV)   2D SDfile   Computed 3D by Vconf -m prep SDfile
Find this compound or compounds like it in BindingDB:
Activity Spreadsheet -- Enzyme Inhibition Constant Data from BindingDB
Found 1 hit for monomerid = 180885
TargetAndrogen receptor(Rattus norvegicus (Rat))
Radius Health
US Patent
LigandPNGBDBM180885(US9133182, Example 14)
Affinity DataIC50: >1.00E+3nM. Assay description: In order to demonstrate the utility of the compounds of this invention, an androgen receptor binding assay was performed wherein many of the compound...
In DepthDetails US Patent