BDBM181967 US9145380, 170
SMILES CN(C)c1ccc(cn1)-c1cccc(c1)S(=O)(=O)Nc1ccccc1S(N)(=O)=O
InChI Key InChIKey=YFKPHJOWQCHRTC-UHFFFAOYSA-N
Data  1 IC50
  Tab Delimited (TSV)   2D SDfile   Computed 3D by Vconf -m prep SDfile
Find this compound or compounds like it in BindingDB:
Activity Spreadsheet -- Enzyme Inhibition Constant Data from BindingDB
Found 1 hit for monomerid = 181967
TargetProstaglandin E synthase 2(Homo sapiens (Human))
Astrazeneca
US Patent
LigandPNGBDBM181967(US9145380, 170)
Affinity DataIC50:  290nMpH: 6.8Assay Description:A solution of test compound was added to a diluted microsome preparation containing human mPGES-1 and pre-incubated for 15 minutes in potassium phosp...
In DepthDetails US Patent