BDBM181971 US9145380, 174
SMILES NS(=O)(=O)c1ccccc1NS(=O)(=O)c1cccc(c1)-c1ccc(Cl)c(Cl)c1
InChI Key InChIKey=NWFQUOGEVIWGPG-UHFFFAOYSA-N
Data  1 IC50
  Tab Delimited (TSV)   2D SDfile   Computed 3D by Vconf -m prep SDfile
Find this compound or compounds like it in BindingDB:
Activity Spreadsheet -- Enzyme Inhibition Constant Data from BindingDB
Found 1 hit for monomerid = 181971
TargetProstaglandin E synthase 2(Homo sapiens (Human))
Astrazeneca
US Patent
LigandPNGBDBM181971(US9145380, 174)
Affinity DataIC50:  220nMpH: 6.8Assay Description:A solution of test compound was added to a diluted microsome preparation containing human mPGES-1 and pre-incubated for 15 minutes in potassium phosp...
In DepthDetails US Patent