BDBM181984 US9145380, 187
SMILES CC(C)(C)C#Cc1ccc(CCS(=O)(=O)Nc2ccccc2S(N)(=O)=O)cn1
InChI Key InChIKey=NRYOGTRHDDJCKP-UHFFFAOYSA-N
Data  1 IC50
  Tab Delimited (TSV)   2D SDfile   Computed 3D by Vconf -m prep SDfile
Find this compound or compounds like it in BindingDB:
Activity Spreadsheet -- Enzyme Inhibition Constant Data from BindingDB
Found 1 hit for monomerid = 181984
TargetProstaglandin E synthase 2(Homo sapiens (Human))
Astrazeneca
US Patent
LigandPNGBDBM181984(US9145380, 187)
Affinity DataIC50:  680nMpH: 6.8Assay Description:A solution of test compound was added to a diluted microsome preparation containing human mPGES-1 and pre-incubated for 15 minutes in potassium phosp...
In DepthDetails US Patent